{"text_format":"1","workbook":"xlsx","n_sheets":8,"sheets":["1.kandidatura","2.kandidatura","3.kandidatura","4.kandidatura","5.kandidatura","Klubovi","VrstaNatjecanja","DaNe"],"not_rendered":{"charts":0,"images":0,"macros":1,"external_links":0,"defined_names":11,"comments":0,"pivot_tables":0},"unopened":[],"bounds":{"document_bytes":16777216,"sheet_cells":100000,"rows_first":2000,"rows_last":500,"rows_between":2000,"halvings":0,"cell_chars":16384,"cell_head_chars":4096},"cells_cut":0,"cells_raw":0,"read":"whole","date_system":"1900"}

{"sheet":"1.kandidatura","index":0,"n_rows":68,"n_cols":6,"rows_kept":68,"cut":false,"hidden":false,"merged":[[56,1,56,3],[67,1,67,4],[12,1,12,4],[1,1,1,4],[0,1,0,4],[14,1,14,3],[44,1,44,3]]}
[null,"HRVATSKI ATLETSKI SAVEZ"]
[null,"OBRAZAC UZ KANDIDATURU ZA ORGANIZACIJU OSTALIH NATJECANJA"]
[]
[]
[null,"Organizator:",null,null,null,{"$f":"IF(ISNA(VLOOKUP(D5,Klubovi!A:B,2,FALSE)),\"obrazac_uz_kandidaturu\",_xlfn.CONCAT(\"obrazac_uz_kandidaturu_\",VLOOKUP(D5,Klubovi!A:B,2,FALSE)))","v":"obrazac_uz_kandidaturu"}]
[]
[null,"Vrsta natjecanja:"]
[]
[null,"Naziv natjecanja:"]
[]
[null,"Datum natjecanja:"]
[]
[null,"Organizator se obvezuje da će osigurati sljedeće (izabrati opciju iz padajućeg izbornika):"]
[]
[null,"OBAVEZNO OSIGURATI"]
[]
[null,"Raspis natjecanja:"]
[]
[null,"Izrada biltena - startne liste i rezultati:"]
[]
[null,"Kompjutorska obrada rezultata:"]
[]
[null,"Dostava rezultata HASu u propisanom roku:"]
[]
[null,"Atletski suci licencirani od HAS-a:"]
[]
[null,"Tehnička služba:"]
[]
[null,"Elektronika/čipovi:"]
[]
[null,"Prijavni centar i provjera sprava (za stad. i dv. natj.):"]
[]
[null,"Semafori za pokazivanje rezultata (tehničke discipline):"]
[]
[null,"Vjetromjeri (za trke do 200 m, dalj i troskok):"]
[]
[null,"Medicinska služba:"]
[]
[null,"Spiker i razglas:"]
[]
[null,"Svlačionice:"]
[]
[null,"Certificirana staza (za izvanstadionska natjecanja): "]
[]
[null,"PREPORUČA SE"]
[]
[null,"Tribine:"]
[]
[null,"Web rezultati tijekom natjecanja:"]
[]
[null,"Live stream natjecanja:"]
[]
[null,"Koncetracijski satovi (za stad. i dv. natjecanja):"]
[]
[null,"Fals start uređaj (za stad. i dv. natjecanja):"]
[]
[null,"POSEBNE POGODNOSTI OD ORGANIZATORA"]
[]
[null,"Okrjepa za sudionike:"]
[]
[null,"Nagrade - novčane nagrade:"]
[]
[null,"Rasvjeta (za večernja natjecanja):"]
[]
[]
[]
[null,"Napomena:"]
[null,"Popunjeni obrazac priložiti kandidaturi za organizaciju natjecanja\nAko imate više natjecanja za koje se kandidirate,\nza svaki od njih treba popuniti jedan list/sheet (2.kandidatura, 3.kandidatura, itd.)"]

{"sheet":"2.kandidatura","index":1,"n_rows":68,"n_cols":6,"rows_kept":68,"cut":false,"hidden":false,"merged":[[67,1,67,4],[0,1,0,4],[1,1,1,4],[12,1,12,4],[14,1,14,3],[44,1,44,3],[56,1,56,3]]}
[null,"HRVATSKI ATLETSKI SAVEZ"]
[null,"OBRAZAC UZ KANDIDATURU ZA ORGANIZACIJU OSTALIH NATJECANJA"]
[]
[]
[null,"Organizator:",null,null,null,{"$f":"IF(ISNA(VLOOKUP(D5,Klubovi!A:B,2,FALSE)),\"obrazac_uz_kandidaturu\",_xlfn.CONCAT(\"obrazac_uz_kandidaturu_\",VLOOKUP(D5,Klubovi!A:B,2,FALSE)))","v":"obrazac_uz_kandidaturu"}]
[]
[null,"Vrsta natjecanja:"]
[]
[null,"Naziv natjecanja:"]
[]
[null,"Datum natjecanja:"]
[]
[null,"Organizator se obvezuje da će osigurati sljedeće (izabrati opciju iz padajućeg izbornika):"]
[]
[null,"OBAVEZNO OSIGURATI"]
[]
[null,"Raspis natjecanja:"]
[]
[null,"Izrada biltena - startne liste i rezultati:"]
[]
[null,"Kompjutorska obrada rezultata:"]
[]
[null,"Dostava rezultata HASu u propisanom roku:"]
[]
[null,"Atletski suci licencirani od HAS-a:"]
[]
[null,"Tehnička služba:"]
[]
[null,"Elektronika/čipovi:"]
[]
[null,"Prijavni centar i provjera sprava (za stad. i dv. natj.):"]
[]
[null,"Semafori za pokazivanje rezultata (tehničke discipline):"]
[]
[null,"Vjetromjeri (za trke do 200 m, dalj i troskok):"]
[]
[null,"Medicinska služba:"]
[]
[null,"Spiker i razglas:"]
[]
[null,"Svlačionice:"]
[]
[null,"Certificirana staza (za izvanstadionska natjecanja): "]
[]
[null,"PREPORUČA SE"]
[]
[null,"Tribine:"]
[]
[null,"Web rezultati tijekom natjecanja:"]
[]
[null,"Live stream natjecanja:"]
[]
[null,"Koncetracijski satovi (za stad. i dv. natjecanja):"]
[]
[null,"Fals start uređaj (za stad. i dv. natjecanja):"]
[]
[null,"POSEBNE POGODNOSTI OD ORGANIZATORA"]
[]
[null,"Okrjepa za sudionike:"]
[]
[null,"Nagrade - novčane nagrade:"]
[]
[null,"Rasvjeta (za večernja natjecanja):"]
[]
[]
[]
[null,"Napomena:"]
[null,"Popunjeni obrazac priložiti kandidaturi za organizaciju natjecanja\nAko imate više natjecanja za koje se kandidirate,\nza svaki od njih treba popuniti jedan list/sheet (2.kandidatura, 3.kandidatura, itd.)"]

{"sheet":"3.kandidatura","index":2,"n_rows":68,"n_cols":6,"rows_kept":68,"cut":false,"hidden":false,"merged":[[67,1,67,4],[0,1,0,4],[1,1,1,4],[12,1,12,4],[14,1,14,3],[44,1,44,3],[56,1,56,3]]}
[null,"HRVATSKI ATLETSKI SAVEZ"]
[null,"OBRAZAC UZ KANDIDATURU ZA ORGANIZACIJU OSTALIH NATJECANJA"]
[]
[]
[null,"Organizator:",null,null,null,{"$f":"IF(ISNA(VLOOKUP(D5,Klubovi!A:B,2,FALSE)),\"obrazac_uz_kandidaturu\",_xlfn.CONCAT(\"obrazac_uz_kandidaturu_\",VLOOKUP(D5,Klubovi!A:B,2,FALSE)))","v":"obrazac_uz_kandidaturu"}]
[]
[null,"Vrsta natjecanja:"]
[]
[null,"Naziv natjecanja:"]
[]
[null,"Datum natjecanja:"]
[]
[null,"Organizator se obvezuje da će osigurati sljedeće (izabrati opciju iz padajućeg izbornika):"]
[]
[null,"OBAVEZNO OSIGURATI"]
[]
[null,"Raspis natjecanja:"]
[]
[null,"Izrada biltena - startne liste i rezultati:"]
[]
[null,"Kompjutorska obrada rezultata:"]
[]
[null,"Dostava rezultata HASu u propisanom roku:"]
[]
[null,"Atletski suci licencirani od HAS-a:"]
[]
[null,"Tehnička služba:"]
[]
[null,"Elektronika/čipovi:"]
[]
[null,"Prijavni centar i provjera sprava (za stad. i dv. natj.):"]
[]
[null,"Semafori za pokazivanje rezultata (tehničke discipline):"]
[]
[null,"Vjetromjeri (za trke do 200 m, dalj i troskok):"]
[]
[null,"Medicinska služba:"]
[]
[null,"Spiker i razglas:"]
[]
[null,"Svlačionice:"]
[]
[null,"Certificirana staza (za izvanstadionska natjecanja): "]
[]
[null,"PREPORUČA SE"]
[]
[null,"Tribine:"]
[]
[null,"Web rezultati tijekom natjecanja:"]
[]
[null,"Live stream natjecanja:"]
[]
[null,"Koncetracijski satovi (za stad. i dv. natjecanja):"]
[]
[null,"Fals start uređaj (za stad. i dv. natjecanja):"]
[]
[null,"POSEBNE POGODNOSTI OD ORGANIZATORA"]
[]
[null,"Okrjepa za sudionike:"]
[]
[null,"Nagrade - novčane nagrade:"]
[]
[null,"Rasvjeta (za večernja natjecanja):"]
[]
[]
[]
[null,"Napomena:"]
[null,"Popunjeni obrazac priložiti kandidaturi za organizaciju natjecanja\nAko imate više natjecanja za koje se kandidirate,\nza svaki od njih treba popuniti jedan list/sheet (2.kandidatura, 3.kandidatura, itd.)"]

{"sheet":"4.kandidatura","index":3,"n_rows":68,"n_cols":6,"rows_kept":68,"cut":false,"hidden":false,"merged":[[67,1,67,4],[0,1,0,4],[1,1,1,4],[12,1,12,4],[14,1,14,3],[44,1,44,3],[56,1,56,3]]}
[null,"HRVATSKI ATLETSKI SAVEZ"]
[null,"OBRAZAC UZ KANDIDATURU ZA ORGANIZACIJU OSTALIH NATJECANJA"]
[]
[]
[null,"Organizator:",null,null,null,{"$f":"IF(ISNA(VLOOKUP(D5,Klubovi!A:B,2,FALSE)),\"obrazac_uz_kandidaturu\",_xlfn.CONCAT(\"obrazac_uz_kandidaturu_\",VLOOKUP(D5,Klubovi!A:B,2,FALSE)))","v":"obrazac_uz_kandidaturu"}]
[]
[null,"Vrsta natjecanja:"]
[]
[null,"Naziv natjecanja:"]
[]
[null,"Datum natjecanja:"]
[]
[null,"Organizator se obvezuje da će osigurati sljedeće (izabrati opciju iz padajućeg izbornika):"]
[]
[null,"OBAVEZNO OSIGURATI"]
[]
[null,"Raspis natjecanja:"]
[]
[null,"Izrada biltena - startne liste i rezultati:"]
[]
[null,"Kompjutorska obrada rezultata:"]
[]
[null,"Dostava rezultata HASu u propisanom roku:"]
[]
[null,"Atletski suci licencirani od HAS-a:"]
[]
[null,"Tehnička služba:"]
[]
[null,"Elektronika/čipovi:"]
[]
[null,"Prijavni centar i provjera sprava (za stad. i dv. natj.):"]
[]
[null,"Semafori za pokazivanje rezultata (tehničke discipline):"]
[]
[null,"Vjetromjeri (za trke do 200 m, dalj i troskok):"]
[]
[null,"Medicinska služba:"]
[]
[null,"Spiker i razglas:"]
[]
[null,"Svlačionice:"]
[]
[null,"Certificirana staza (za izvanstadionska natjecanja): "]
[]
[null,"PREPORUČA SE"]
[]
[null,"Tribine:"]
[]
[null,"Web rezultati tijekom natjecanja:"]
[]
[null,"Live stream natjecanja:"]
[]
[null,"Koncetracijski satovi (za stad. i dv. natjecanja):"]
[]
[null,"Fals start uređaj (za stad. i dv. natjecanja):"]
[]
[null,"POSEBNE POGODNOSTI OD ORGANIZATORA"]
[]
[null,"Okrjepa za sudionike:"]
[]
[null,"Nagrade - novčane nagrade:"]
[]
[null,"Rasvjeta (za večernja natjecanja):"]
[]
[]
[]
[null,"Napomena:"]
[null,"Popunjeni obrazac priložiti kandidaturi za organizaciju natjecanja\nAko imate više natjecanja za koje se kandidirate,\nza svaki od njih treba popuniti jedan list/sheet (2.kandidatura, 3.kandidatura, itd.)"]

{"sheet":"5.kandidatura","index":4,"n_rows":68,"n_cols":6,"rows_kept":68,"cut":false,"hidden":false,"merged":[[67,1,67,4],[0,1,0,4],[1,1,1,4],[12,1,12,4],[14,1,14,3],[44,1,44,3],[56,1,56,3]]}
[null,"HRVATSKI ATLETSKI SAVEZ"]
[null,"OBRAZAC UZ KANDIDATURU ZA ORGANIZACIJU OSTALIH NATJECANJA"]
[]
[]
[null,"Organizator:",null,null,null,{"$f":"IF(ISNA(VLOOKUP(D5,Klubovi!A:B,2,FALSE)),\"obrazac_uz_kandidaturu\",_xlfn.CONCAT(\"obrazac_uz_kandidaturu_\",VLOOKUP(D5,Klubovi!A:B,2,FALSE)))","v":"obrazac_uz_kandidaturu"}]
[]
[null,"Vrsta natjecanja:"]
[]
[null,"Naziv natjecanja:"]
[]
[null,"Datum natjecanja:"]
[]
[null,"Organizator se obvezuje da će osigurati sljedeće (izabrati opciju iz padajućeg izbornika):"]
[]
[null,"OBAVEZNO OSIGURATI"]
[]
[null,"Raspis natjecanja:"]
[]
[null,"Izrada biltena - startne liste i rezultati:"]
[]
[null,"Kompjutorska obrada rezultata:"]
[]
[null,"Dostava rezultata HASu u propisanom roku:"]
[]
[null,"Atletski suci licencirani od HAS-a:"]
[]
[null,"Tehnička služba:"]
[]
[null,"Elektronika/čipovi:"]
[]
[null,"Prijavni centar i provjera sprava (za stad. i dv. natj.):"]
[]
[null,"Semafori za pokazivanje rezultata (tehničke discipline):"]
[]
[null,"Vjetromjeri (za trke do 200 m, dalj i troskok):"]
[]
[null,"Medicinska služba:"]
[]
[null,"Spiker i razglas:"]
[]
[null,"Svlačionice:"]
[]
[null,"Certificirana staza (za izvanstadionska natjecanja): "]
[]
[null,"PREPORUČA SE"]
[]
[null,"Tribine:"]
[]
[null,"Web rezultati tijekom natjecanja:"]
[]
[null,"Live stream natjecanja:"]
[]
[null,"Koncetracijski satovi (za stad. i dv. natjecanja):"]
[]
[null,"Fals start uređaj (za stad. i dv. natjecanja):"]
[]
[null,"POSEBNE POGODNOSTI OD ORGANIZATORA"]
[]
[null,"Okrjepa za sudionike:"]
[]
[null,"Nagrade - novčane nagrade:"]
[]
[null,"Rasvjeta (za večernja natjecanja):"]
[]
[]
[]
[null,"Napomena:"]
[null,"Popunjeni obrazac priložiti kandidaturi za organizaciju natjecanja\nAko imate više natjecanja za koje se kandidirate,\nza svaki od njih treba popuniti jedan list/sheet (2.kandidatura, 3.kandidatura, itd.)"]

{"sheet":"Klubovi","index":5,"n_rows":120,"n_cols":2,"rows_kept":120,"cut":false,"hidden":true,"merged":[]}
["AGR - AK Agram, Zagreb","AGR"]
["ALB - AK Albona, Labin","ALB"]
["ALBA - SRK Alba, Labin","ALBA"]
["ASK - ASK, Split","ASK"]
["ASZ - AK Alojzije Stepinac, Zadar","ASZ"]
["BEN - AŠK Benkovac, Benkovac","BEN"]
["BIO - AK Biograd, Biograd na Moru","BIO"]
["BJ - AK Bjelovar, Bjelovar","BJ"]
["BORBJ - AK Borik, Bjelovar","BORBJ"]
["BRI - AK Bribir, Bribir","BRI"]
["CV - AK Cibalia, Vinkovci","CV"]
["DIOKL - AK Dioklecijan, Split","DIOKL"]
["DS - AK Stubica, Donja Stubica","DS"]
["DU - AK Dubrovnik, Dubrovnik","DU"]
["DZ - AK Dinamo-Zrinjevac, Zagreb","DZ"]
["ĐAK - AK Đakovo, Đakovo","ĐAK"]
["FIT - AK Fit, Zaprešić","FIT"]
["FLZ - MK Festina Lente, Zadar","FLZ"]
["FORCA - AK Forca, Zagreb","FORCA"]
["FORZD - AK Fortius, Zadar","FORZD"]
["GAK - AK Glina, Glina","GAK"]
["GAR - AK Garešnica, Garešnica","GAR"]
["GOJ - AK Gojanec, Vidovec","GOJ"]
["GROBN - AK Grobnik, Čavle","GROBN"]
["HAJ - AK Hajduk, Split","HAJ"]
["HS - MK Hrvatski Sokol, Osijek","HS"]
["IP - AK Istra, Pula","IP"]
["IVIV - TK Ivančica, Ivanec","IVIV"]
["JAS - JAK, Jasenovac","JAS"]
["JAS99 - AK Jastreb 99, Jastrebarsko","JAS99"]
["JC - AK Jadran, Crikvenica","JC"]
["KATIM - KATIM, Karlovac","KATIM"]
["KAVZ - KAV, Zadar","KAVZ"]
["KBK - TK Kotoripski begači, Kotoriba","KBK"]
["KC - AK Koprivnica, Koprivnica","KC"]
["KCIPT - KCIPT Samobor, Samobor","KCIPT"]
["KK - AK Karlovac, Karlovac","KK"]
["KN - AK Knin, Knin","KN"]
["KR - AK Kvarner, Rijeka","KR"]
["KRK - AK Krk, Krk","KRK"]
["KŽ - AK Križevci, Križevci","KŽ"]
["LIBUR - AK Liburnija, Rijeka","LIBUR"]
["LŠNJ - AK Lošinj, Veli Lošinj","LŠNJ"]
["M95 - TK Marathon 95, Varaždin","M95"]
["MAKVŽ - MAK, Varaždin","MAKVŽ"]
["MAKZG - AK Maksimir, Zagreb","MAKZG"]
["MARKA - AK Maraton 2000, Karlovac","MARKA"]
["MARKR - TK Maraton, Krapina","MARKR"]
["MARKT - AK Maratonjare, Kutina","MARKT"]
["MAV - AK Maraton, Vukovar","MAV"]
["MAX - AK Maximvs, Poreč","MAX"]
["MAZSB - UMK Mazator, Slavonski Brod","MAZSB"]
["MČ - AK Međimurje, Čakovec","MČ"]
["MDS - AK Martin Dugo Selo, Dugo Selo","MDS"]
["MED - AK Medulin, Medulin","MED"]
["MK - AK Moslavina, Kutina","MK"]
["MREŽ - AK Mrežnica, Duga Resa","MREŽ"]
["MS - AK Mursko Središće, Mursko Središće","MS"]
["MSB - AK Marsonia, Slavonski Brod","MSB"]
["MSP - MK Marjan, Split","MSP"]
["MUPKT - AK Moslavina u pokretu, Kutina","MUPKT"]
["MVG - MK Velika Gorica, Velika Gorica","MVG"]
["MZ - HAAK Mladost, Zagreb","MZ"]
["NED - AK Nedelišće, Nedelišće","NED"]
["NEXE - URT NEXE TEAM, Našice","NEXE"]
["NG - AK Nova Gradiška, Nova Gradiška","NG"]
["NOGA - AK Novljanska grupa atletičara, Novska","NOGA"]
["OKIT - AK Okit-Vodice, Vodice","OKIT"]
["OLUM - SRU Olimpik, Umag","OLUM"]
["OLZ - AK Olympionik, Zadar","OLZ"]
["OMIŠ - AK Omiš, Omiš","OMIŠ"]
["OROS - AK Oroslavje, Oroslavje","OROS"]
["OTOK - AK Otok, Otok","OTOK"]
["PAKOS - AK Pakoštane, Pakoštane","PAKOS"]
["PLI - AK Plitvice, Plitvička jezera","PLI"]
["PMZG - AK Perpetuum mobile, Zagreb","PMZG"]
["POŽ - AK Požega, Požega","POŽ"]
["PULS - SRK Puls, Ližnjan","PULS"]
["RI - AK Rijeka, Rijeka","RI"]
["RIKA - AK Rika, Kastav","RIKA"]
["RIMAR - AK RI Maraton, Rijeka","RIMAR"]
["ROG - AŠK Rogovo, Sv. Filip i Jakov","ROG"]
["RPGS - AK Rudolf Perešin, Gornja Stubica","RPGS"]
["RUNFO - SRK Running Fox, Poreč","RUNFO"]
["SAM - AK Samobor 2007, Samobor","SAM"]
["SAP - AK Sveti Ante, Poličnik","SAP"]
["SAPĐ - AK Sla-Ante Peric, Đakovo","SAPĐ"]
["SESV - ASK Sesvete, Zagreb","SESV"]
["SI - AK Sisak, Sisak","SI"]
["SIM - AK Sportske igre mladih, Split","SIM"]
["SLA - AK Slatina, Slatina","SLA"]
["SLJZ - AK Sljeme, Zagreb","SLJZ"]
["SO - AK Slavonija-Žito, Osijek","SO"]
["SOLIN - AK Solin, Solin","SOLIN"]
["START - AK Start, Zadar","START"]
["SV - AK Sloboda, Varaždin","SV"]
["SVA - AK Sveti Ante, Knin","SVA"]
["SVID - AK Sveti Vid, Vrbovec","SVID"]
["SVM - AK Sveti Marko, Makarska","SVM"]
["SVZG - AK Svetice, Zagreb","SVZG"]
["ŠI - AK Šibenik, Šibenik","ŠI"]
["UDPKA - Udruga Dodir prirode, Karlovac","UDPKA"]
["UDTOM - Udruga Dalmacija Trails, Omiš","UDTOM"]
["ULZG - AK Ultra Zagreb, Zagreb","ULZG"]
["UVSP - AK Udruge veterana specijalne policije, Split","UVSP"]
["VEL - AK Velebit 2001, Gospić","VEL"]
["VG - AK Velika Gorica, Velika Gorica","VG"]
["VIŠ - AK Viškovo, Viškovo","VIŠ"]
["VRB - AK Vrbovec, Vrbovec","VRB"]
["VTCA - AK Virovitica, Virovitica","VTCA"]
["VUK - AK Vukovar, Vukovar","VUK"]
["VVŽ - AK Varaždin, Varaždin","VVŽ"]
["ZABOK - AK Zabok, Zabok","ZABOK"]
["ZAD - AŠK, Zadar","ZAD"]
["ZAG - AK Zagreb, Zagreb","ZAG"]
["ZAPR - AK Zaprešić, Zaprešić","ZAPR"]
["ŽUM - AK Žumberak, Sošice","ŽUM"]
["DAL - Dalmatinska atletska Liga","DAL"]
["ASPGŽ - Atletski savez PGŽ","ASPGŽ"]
["ZAS - Zagrebačka atletski savez","ZAS"]

{"sheet":"VrstaNatjecanja","index":6,"n_rows":14,"n_cols":4,"rows_kept":14,"cut":false,"hidden":true,"merged":[]}
["Vrsta","Stadionska","Izvanstadionska","Dvoranska"]
["Stadionska","05.-06.03.2022. - Zimsko bacačko prvenstvo Hrvatske","12.03.2022. - Ekipno prvenstvo Hrvatske u krosu","29.01.2022. - Prvenstvo Hrvatske u dvorani, ml. seniori-ke"]
["Izvanstadionska","03.04.2022. - Pojedinačno i ekipno PH u 1-satnom trčanju","07.05.2022. - Pojedinačno i ekipno PH u planinskom trčanju","05.02.2022. - Prvenstvo Hrvatske u dvorani, juniori-ke"]
["Dvoranska","30.04.2022. - Pojedinačno PH na 10000 m i hodanju na stazi","15.10.2022. - Pojedinačno PH u cestovnom hodanju","12.02.2022. - Prvenstvo Hrvatske u dvorani, kadeti-kinje"]
[null,"30.04.-01.05.2022. - Prvenstvo Hrvatske u višebojima","22.10.2022. - Pojedinačno prvenstvo Hrvatske u krosu","13.02.2022. - Prvenstvo Hrvatske u dvorani, ml.kadeti-kinje"]
[null,"28.05.2022. - Prvenstvo Hrvatske u štafetama","29.10.2022. - Pojedinačno i ekipno PH u cestovnom trčanju","19.02.2022. - Prvenstvo Hrvatske u dvorani, ml.juniori-ke"]
[null,"04.-05.06.2022. - Kup i ekipno prvenstvo Hrvatske, juniori-ke","Pojedinačno i ekipno PH u polumaratonu","26.02.2022. - Prvenstvo Hrvatske u dvorani, seniori-ke"]
[null,"11.-12.06.2022. - Pojedinačno prvenstvo Hrvatske, mlađi juniori-ke","Pojedinačno i ekipno PH u maratonu","05.-06.03.2022. - Prvenstvo Hrvatske u višebojima u dvorani"]
[null,"18.-19.06.2022. - Pojedinačno PH, kadeti-kinje, ml.kadeti-kinje","Pojedinačno i ekipno PH na 100 km"]
[null,"25.-26.06.2022. - Pojedinačno prvenstvo Hrvatske, seniori-ke","Pojedinačno i ekipno PH u 12-satnom trčanju"]
[null,"09.-10.07.2022. - Pojedinačno prvenstvo Hrvatske, juniori-ke","Pojedinačno i ekipno PH u planinskom trčanu na duge staze"]
[null,"03.-04.09.2022. - Pojedinačno prvenstvo Hrvatske, ml.seniori-ke","Pojedinačno i ekipno PH u trailu"]
[null,"10.09.2022. - Kup i ekipno prvenstvo Hrvatske, kadeti-kinje"]
[null,"17.-18.09.2022. - Kup i ekipno prvenstvo Hrvatske, seniori-ke"]

{"sheet":"DaNe","index":7,"n_rows":2,"n_cols":1,"rows_kept":2,"cut":false,"hidden":true,"merged":[]}
["DA"]
["NE"]